BDBM50181520 CHEMBL3818609
SMILES Nc1nc2[nH]c(SCc3ccc(F)c(F)c3)nc2c(=O)[nH]1
InChI Key InChIKey=RVLHWXMRHVKCGE-UHFFFAOYSA-N
Data  2 Kd
  Tab Delimited (TSV)   2D SDfile   Computed 3D by Vconf -m prep SDfile
Find this compound or compounds like it in BindingDB:
Activity Spreadsheet -- Enzyme Inhibition Constant Data from BindingDB
Found 1 hit for monomerid = 50181520
Target2-amino-4-hydroxy-6-hydroxymethyldihydropteridine pyrophosphokinase(Escherichia coli (strain K12))
Monash University
Curated by ChEMBL
LigandPNGBDBM50181520(CHEMBL3818609)
Affinity DataKd:  2.00E+3nM. Assay description: Binding affinity to biotinylated Escherichia coli HPPK expressed in Escherichia coli BL21 (DE3) in presence of 1 mM ATP by SPR assay
In DepthDetails ArticlePubMed